{"text_format":"1","workbook":"xlsx","n_sheets":10,"sheets":["【非表示】更新履歴","管理ｼｰﾄ","入力シート","園一覧","希望園関係","申込書","家庭の状況","児童の健康状況報告書","申込みチェックシート","提出書類チェックシート"],"not_rendered":{"charts":0,"images":10,"macros":1,"external_links":0,"defined_names":35,"comments":3,"pivot_tables":0},"unopened":[],"bounds":{"document_bytes":16777216,"sheet_cells":100000,"rows_first":2000,"rows_last":500,"rows_between":2000,"halvings":0,"cell_chars":16384,"cell_head_chars":4096},"cells_cut":0,"cells_raw":0,"read":"whole","date_system":"1900"}

{"sheet":"【非表示】更新履歴","index":0,"n_rows":37,"n_cols":11,"rows_kept":37,"cut":false,"hidden":true,"merged":[[1,1,1,4],[2,1,12,4]]}
[]
[null,"バージョン番号付与の統一規則について",null,null,null,null,"ver","更新日\n(西暦8桁で入力)","更新種別","更新内容","更新者"]
[null,"メジャーバージョン番号 (ver1.0なら1にあたる番号)\nコンセプトはそのままに一から作り直した場合や、作り直しに相当するほどの大きな変更があった場合に更新。外観の大きな変更を伴うことが多い。 \n書式の変更があった場合など。\n\nマイナーバージョン番号 (ver1.2なら2にあたる番号)\n・機能の追加・削除、操作性の変更等があった場合に更新。 \n\nリビジョン番号(ver1.2.3なら3にあたる番号)\nバグ修正やリファクタリング(動作に影響を与えないソースコードの整理)　等があった場合に更新。 \n園の追加や参照年月の変更など。",null,null,null,null,"1.0",20191115,"追加","初版"]
[null,null,null,null,null,null,"1.0.1",20200120,"変更","一部不具合の修正"]
[null,null,null,null,null,null,"1.1",20200222,"変更","保育希望終了日をプルダウンから選べるように変更"]
[null,null,null,null,null,null,null,null,"変更","保育の希望の有無をデフォルトで☑有になるよう変更"]
[null,null,null,null,null,null,null,null,"変更","両親の生年月日を2004年以前から遡るように変更"]
[null,null,null,null,null,null,"1.1.2",20200419,"削除","園一覧からつくし保育園を削除"]
[null,null,null,null,null,null,null,null,"変更","入力シートのデザイン変更"]
[null,null,null,null,null,null,"1.2",20200525,"追加","家庭の状況入力フォームの作成"]
{"$rows_left_out":28}
{"sheet":"管理ｼｰﾄ","index":1,"n_rows":120,"n_cols":118,"rows_kept":120,"cut":false,"hidden":true,"merged":[[6,0,10,2],[1,0,3,4]]}
[1,2,3,4,5,6,7,8,9,10,11,12,13,14,15,16,17,18,19,20,21,22,23,24,25,26,27,28,29,30,31,32,33,34,35,36,37,38,39,40,41,42,43,44,45,46,47,48,49,50,51,52,53,54,55,56,57,58,59,60,61,62,63,64,65,66,67,68,69,70,71,72,73,74,75,76,77,78,79,80,81,82,83,84,85,86,87,88,89,90,91,92,93,94,95,96,97,98,99,100,101,102,103,104,105,106,107,108,109,110,111,112,113,114,115,116,117,118]
["【注意】シート名を変えない！行や列の追加を行わないこと！！\n（変える場合は参照している全てのコードを書き換えてください\n）"]
[]
[]
[]
[]
["このシートで各入力フォームのプルダウンリストの中身を管理しています。入力情報シートの色がついているセルは数式が入っている場合があるので、ロックの解除後は取り扱いに注意。",null,null,"チェック","性別","日にち","月","西暦","お迎えの時間","分","預けの時間","曜日","母の事由","父の事由","時間","分","入園希望日の年度の4/1","１人目のクラス年齢","２人目のクラス年齢","選考月","手帳","頻度","続き柄","前年","チェックボクス"]
[null,null,null,null,"男",1,1,{"$f":"H9+1","v":2032},14,"00",7,"月","就労","就労",0,0,{"$f":"IF(MONTH(#REF!)<=3, DATE((YEAR(#REF!)-1),4,1), DATE((YEAR(#REF!)),4,1))","v":{"$error":"#REF!"}},null,null,4,"身体障害者手帳","週","父","豊島区内","□","有","〇"]
[null,null,null,"該当","女",2,2,2031,15,15,8,"火","妊娠・出産","疾病・障害",1,1,null,null,null,5,"愛の手帳","月","母","豊島区外","☑","無"]
[null,null,null,null,null,3,3,2030,16,30,9,"水","疾病・障害","介護・看護",2,2,null,null,null,6,"精神障害者保健福祉手帳",null,"祖父"]
{"$rows_left_out":111}
{"sheet":"入力シート","index":2,"n_rows":0,"n_cols":0,"rows_kept":0,"cut":false,"hidden":false,"merged":[]}

{"sheet":"園一覧","index":3,"n_rows":118,"n_cols":9,"rows_kept":118,"cut":false,"hidden":true,"merged":[]}
["No.","園名","園コード","種別","年齢制限","０歳児保育","備考"]
[1,"駒込第一保育園",1105001,"公立"]
[2,"巣鴨第一保育園　　",1105004,"公立"]
[3,"西巣鴨第三保育園",1105005,"公立"]
[4,"東池袋第二保育園",1105008,"公立"]
[5,"西池袋第二保育園",1105009,"公立",null,"生後４か月経過児から"]
[6,"池袋第一保育園",1105010,"公立"]
[7,"池袋第二保育園",1105011,"公立"]
[8,"池袋第五保育園",1105013,"公立"]
[9,"高南保育園",1105015,"公立"]
{"$rows_left_out":109}
{"sheet":"希望園関係","index":4,"n_rows":76,"n_cols":36,"rows_kept":76,"cut":false,"hidden":true,"merged":[[16,1,16,2],[1,33,1,35],[3,33,3,34],[2,33,2,35],[4,33,5,34],[4,35,5,35],[1,28,1,31],[1,18,1,21],[1,23,1,26],[2,7,2,15],[7,7,7,15],[12,1,12,6],[12,7,12,15],[10,7,10,15],[7,1,7,6],[3,28,17,28],[8,1,8,6],[9,1,9,6],[10,1,10,6],[8,7,8,15],[9,7,9,15],[17,7,17,8],[3,7,3,15],[4,7,4,15],[5,7,5,15],[6,7,6,15],[2,23,75,23],[18,28,19,28],[20,28,23,28],[24,28,25,28],[16,9,16,15],[3,18,19,18],[20,18,21,18],[11,7,11,15],[14,1,15,15],[2,1,2,6],[3,1,3,6],[4,1,4,6],[5,1,5,6],[6,1,6,6],[11,1,11,6],[16,3,16,7]]}
[]
[null,"★マークがついている箇所はプルダウンでも選択できます。",null,null,null,null,null,null,null,null,null,null,null,null,null,null,null,null,"区立",null,null,null,null,"私立",null,null,null,null,"地域型保育事業",null,null,null,null,"その他"]
[null,"第１希望",null,null,null,null,null,"駒込第一保育園",null,null,null,null,null,null,null,null,{"$f":"IFERROR(VLOOKUP(希望園関係!H3,園一覧!$B:$C,2,0),\"\")","v":1105001},null,null,null,"番号","保育園名",null,"民設民営",null,"番号","保育園名",null,null,null,"番号","保育園名",null,"園名"]
[null,"第２希望",null,null,null,null,null,"東池袋第二保育園",null,null,null,null,null,null,null,null,{"$f":"IFERROR(VLOOKUP(希望園関係!H4,園一覧!$B:$C,2,0),\"\")","v":1105008},null,"公設公営",1,1105001,"駒込第一保育園",null,null,20,2110102,"ミアヘルサ保育園ひびき駒込",null,"小規模保育事業Ａ型",93,2410060,"このえ駒込小規模保育園",null,"居宅訪問型\n保育事業",null,"障害児訪問保育アニー"]
[null,"第３希望",null,null,null,null,null,null,null,null,null,null,null,null,null,null,{"$f":"IFERROR(VLOOKUP(希望園関係!H5,園一覧!$B:$C,2,0),\"\")","v":""},null,null,2,1105004,"巣鴨第一保育園",null,null,21,2110068,"コンビプラザ駒込ちどり保育園",null,null,94,2410005,"ドリームキッズすがも保育園",null,"認定こども園\n（保育を必要とする場合）",null,"要町幼稚園"]
[null,"第４希望",null,null,null,null,null,null,null,null,null,null,null,null,null,null,{"$f":"IFERROR(VLOOKUP(希望園関係!H6,園一覧!$B:$C,2,0),\"\")","v":""},null,null,3,1105005,"西巣鴨第三保育園",null,null,22,2110090,"さくらさくみらい　駒込",null,null,95,2410059,"おうち保育園すがも"]
[null,"第５希望",null,null,null,null,null,null,null,null,null,null,null,null,null,null,{"$f":"IFERROR(VLOOKUP(希望園関係!H7,園一覧!$B:$C,2,0),\"\")","v":""},null,null,4,1105007,"東池袋第一保育園",null,null,23,2110293,"キッズパートナー駒込",null,null,96,2404004,"おうち保育園おおつか"]
[null,"第６希望",null,null,null,null,null,null,null,null,null,null,null,null,null,null,{"$f":"IFERROR(VLOOKUP(希望園関係!H8,園一覧!$B:$C,2,0),\"\")","v":""},null,null,5,1105008,"東池袋第二保育園",null,null,24,2110405,"駒込第二若草保育園",null,null,97,2404008,"南大塚早樹保育園"]
[null,"第７希望",null,null,null,null,null,null,null,null,null,null,null,null,null,null,{"$f":"IFERROR(VLOOKUP(希望園関係!H9,園一覧!$B:$C,2,0),\"\")","v":""},null,null,6,1105009,"西池袋第二保育園",null,null,25,2110012,"太陽の子　巣鴨駅前保育園",null,null,98,2410006,"ドリームキッズかみいけ保育園"]
[null,"第８希望",null,null,null,null,null,null,null,null,null,null,null,null,null,null,{"$f":"IFERROR(VLOOKUP(希望園関係!H10,園一覧!$B:$C,2,0),\"\")","v":""},null,null,7,1105010,"池袋第一保育園",null,null,26,2110327,"うぃず巣鴨駅前第二保育園",null,null,99,2404007,"東池袋早樹保育園"]
{"$rows_left_out":67}
{"sheet":"申込書","index":5,"n_rows":59,"n_cols":76,"rows_kept":59,"cut":false,"hidden":false,"merged":[[20,0,21,8],[20,37,21,45],[16,0,19,5],[23,0,23,30],[23,35,23,43],[58,1,58,78],[54,29,55,34],[54,51,55,56],[54,57,55,78],[56,29,57,34],[34,0,34,8],[34,9,34,34],[34,35,34,78],[41,0,41,8],[41,9,41,34],[23,44,27,54],[24,0,27,8],[28,0,31,8],[28,31,31,34],[28,44,31,54],[46,57,47,78],[33,0,33,34],[52,6,52,28],[48,29,49,34],[35,89,35,164],[36,0,37,8],[36,9,37,34],[37,89,37,164],[38,0,38,8],[38,9,38,34],[35,0,35,8],[35,9,35,34],[29,9,30,30],[30,35,31,37],[30,38,31,39],[30,40,31,41],[30,42,31,43],[45,87,45,162],[46,0,57,5],[41,87,42,142],[42,0,42,8],[42,9,42,34],[40,59,40,62],[41,59,41,62],[40,63,40,78],[41,63,41,78],[42,59,42,62],[42,63,42,78],[52,29,53,34],[48,35,49,39],[48,40,49,41],[48,42,49,44],[48,45,49,46],[48,49,49,50],[50,35,51,39],[50,40,51,41],[50,42,51,44],[43,87,43,106],[39,0,39,8],[39,9,39,34],[39,35,39,78],[39,84,39,159],[40,0,40,8],[40,9,40,34],[40,35,41,53],[43,59,43,62],[43,63,43,78],[46,51,47,56],[56,51,57,56],[56,57,57,78],[48,57,49,78],[50,29,51,34],[53,6,53,28],[54,6,54,28],[55,6,55,28],[56,6,56,28],[57,6,57,28],[48,6,48,28],[49,6,49,28],[50,6,50,28],[51,6,51,28],[56,35,57,39],[56,40,57,41],[56,42,57,44],[56,45,57,46],[56,49,57,50],[50,51,51,56],[50,57,51,78],[48,51,49,56],[52,51,53,56],[52,57,53,78],[0,0,0,21],[1,0,2,78],[4,0,4,18],[4,55,4,78],[5,0,7,78],[8,0,10,13],[17,6,19,8],[19,9,19,18],[12,0,15,5],[12,6,12,8],[12,31,15,34],[12,44,15,54],[13,6,15,8],[11,31,11,34],[11,35,11,43],[16,6,16,8],[16,31,19,34],[16,44,19,54],[12,9,12,14],[16,9,16,14],[11,44,11,54],[11,55,11,78],[15,9,15,18],[11,0,11,30],[12,55,15,78],[16,55,19,78],[23,55,24,62],[23,63,24,64],[23,66,24,68],[23,69,24,73],[12,35,13,41],[16,35,17,41],[16,42,17,43],[23,74,24,78],[20,46,20,55],[43,0,44,8],[43,9,44,34],[42,35,44,53],[44,54,44,78],[40,54,41,58],[42,54,43,58],[35,35,35,38],[35,39,35,48],[35,49,35,51],[35,52,35,78],[21,71,21,78],[48,47,49,48],[50,47,51,48],[36,35,38,78],[33,35,33,78],[24,31,27,34],[27,9,27,18],[23,31,23,34],[31,9,31,18],[31,19,31,30],[28,15,28,30],[28,63,31,66],[25,74,27,78],[25,55,27,73],[28,55,31,57],[28,58,31,59],[28,60,31,62],[28,67,31,69],[28,70,31,71],[28,72,31,74],[28,75,31,78],[46,6,47,28],[46,29,47,34],[46,35,47,50],[14,40,15,41],[14,35,15,37],[18,35,19,37],[28,35,29,41],[28,42,29,43],[28,9,28,14],[20,19,20,25],[21,19,21,25],[20,26,20,28],[21,26,21,28],[20,29,20,36],[21,29,21,36],[20,9,20,18],[21,9,21,18],[13,9,14,30],[17,9,18,30],[12,42,13,43],[14,38,15,39],[14,42,15,43],[16,15,16,26],[12,15,12,26],[8,14,8,16],[8,17,8,29],[9,14,10,78],[15,19,15,30],[19,19,19,30],[24,35,25,41],[24,42,25,43],[25,9,26,30],[26,35,27,37],[26,40,27,41],[26,38,27,39],[26,42,27,43],[24,15,24,30],[27,19,27,30],[24,9,24,14],[21,46,21,55],[20,68,20,70],[21,68,21,70],[20,56,20,67],[21,56,21,67],[20,71,20,78],[18,38,19,39],[18,42,19,43],[18,40,19,41],[52,47,53,48],[54,47,55,48],[56,47,57,48],[50,45,51,46],[50,49,51,50],[52,35,53,39],[52,40,53,41],[52,42,53,44],[52,45,53,46],[52,49,53,50],[54,35,55,39],[54,40,55,41],[54,42,55,44],[54,45,55,46],[54,49,55,50]]}
["第4号様式（第2条、第3条関係）"]
["教育・保育給付認定申請書 兼 認可保育施設等入所申込書"]
[]
[]
["豊島区長 様",null,null,null,null,null,null,null,null,null,null,null,null,null,null,null,null,null,null,null,null,null,null,null,null,null,null,null,null,null,null,null,null,null,null,null,null,null,null,null,null,null,null,null,null,null,null,null,null,null,null,null,null,null,null,{"$f":"TEXT(TODAY(),\"ggge年m月d日\")","v":"令和4年10月11日"}]
["子ども・子育て支援法による教育・保育給付認定および認可保育施設等の入所について、次のとおり申請します。\n申請にあたり、保育認定・利用調整・保育料決定に必要な区が保有する個人情報を利用すること及び特定教育・保育施設、区関係機関等に必要に応じ情報を提供することに同意します。また、個人番号を利用し他市区町村に個人情報の照会を行うことについて同意します。"]
[]
[]
["現住所\n（別居の保護者がいる場合、別居先も記載してください）",null,null,null,null,null,null,null,null,null,null,null,null,null,"〒"]
[null,null,null,null,null,null,null,null,null,null,null,null,null,null,"豊島区"]
{"$rows_left_out":50}
{"sheet":"家庭の状況","index":6,"n_rows":44,"n_cols":25,"rows_kept":44,"cut":false,"hidden":false,"merged":[[3,15,3,19],[3,6,3,11],[28,14,29,15],[29,17,29,22],[30,14,30,22],[25,14,25,22],[26,20,26,21],[27,14,27,15],[27,16,27,17],[27,18,27,19],[27,20,27,21],[11,14,11,15],[11,16,11,17],[11,18,11,19],[11,20,11,21],[20,14,21,16],[22,14,22,22],[23,14,23,15],[23,17,23,21],[24,14,24,22],[17,14,17,16],[17,17,17,22],[18,14,18,16],[18,17,18,20],[37,1,39,1],[40,1,42,1],[42,2,42,3],[41,2,41,3],[40,2,40,3],[39,2,39,3],[30,0,32,0],[30,2,31,4],[30,5,30,13],[32,7,32,8],[36,9,36,15],[33,5,33,11],[33,14,33,16],[40,9,40,15],[41,9,41,15],[36,16,36,21],[37,16,37,21],[38,16,38,21],[40,16,40,21],[32,16,32,17],[41,16,41,21],[37,9,37,15],[0,7,0,22],[38,2,38,3],[37,2,37,3],[32,2,32,4],[19,5,19,7],[20,5,21,7],[18,5,18,7],[26,2,27,4],[24,2,24,4],[17,5,17,7],[14,1,16,4],[17,1,21,4],[24,1,27,1],[17,8,17,13],[0,0,0,5],[1,0,1,22],[6,2,6,4],[6,5,6,13],[7,5,7,13],[9,2,9,4],[9,5,9,13],[11,11,11,12],[12,2,13,4],[11,7,11,8],[43,0,43,22],[36,4,36,7],[37,0,42,0],[38,4,38,7],[33,0,33,4],[30,1,32,1],[42,4,42,22],[2,0,2,22],[40,4,40,7],[41,4,41,7],[39,4,39,22],[37,4,37,7],[6,0,13,0],[6,1,13,1],[5,2,5,22],[4,11,4,13],[4,20,4,22],[10,2,11,4],[10,11,10,12],[10,9,10,10],[8,2,8,4],[8,5,8,13],[3,0,4,4],[7,2,7,4],[28,0,29,0],[28,5,29,6],[29,8,29,13],[15,5,15,13],[16,5,16,6],[18,8,18,11],[14,0,16,0],[25,2,25,4],[24,5,24,13],[25,5,25,13],[17,0,21,0],[26,11,26,12],[27,5,27,6],[24,0,27,0],[22,0,23,0],[22,1,23,4],[22,5,22,13],[23,5,23,6],[23,8,23,12],[28,1,29,4],[4,15,4,19],[4,6,4,10],[38,9,38,15],[27,7,27,8],[14,5,14,6],[14,7,14,8],[27,11,27,12],[27,9,27,10],[6,14,6,22],[7,14,7,22],[8,14,8,22],[9,14,9,22],[10,18,10,19],[11,5,11,6],[16,7,16,13],[11,9,11,10],[14,14,14,15],[14,16,14,17],[15,14,15,22],[16,14,16,15],[16,16,16,22],[10,20,10,21],[19,14,19,16]]}
["第5号様式（第3条関係）"]
["家　　　庭　　　の　　　状　　　況 "]
[]
["不存在の場合、氏名欄は空欄で提出してください。父母以外が保護者の場合、父母欄を二重線で消し、欄外に続柄を記載してください。",null,null,null,null,"フリガナ　",{"$f":"IF(申込書!P13=\"\",\"\",申込書!P13)","v":""},null,null,null,null,null,null,null,"フリガナ　",{"$f":"IF(申込書!P17=\"\",\"\",申込書!P17)","v":""}]
[null,null,null,null,null,{"$f":"IF(申込書!AF13=\"\",\"（氏名\",申込書!AF13&\"（氏名\")","v":"（氏名"},{"$f":"IF(申込書!J14=\"\",\"\",\"   \"&申込書!J14)","v":""},null,null,null,null,"）の状況",null,null,{"$f":"IF(申込書!AF17=\"\",\"（氏名\",申込書!AF17&\"（氏名\")","v":"（氏名"},{"$f":"IF(申込書!J18=\"\",\"\",申込書!J18)","v":""},null,null,null,null,"）の状況"]
["№",null,"該当する状況すべてに詳しく記載してください。"]
[1,"就労\n（内定）","就労状況"]
[null,null,"事業所名"]
[null,null,"勤務地"]
[null,null,"仕事内容"]
{"$rows_left_out":35}
{"sheet":"児童の健康状況報告書","index":7,"n_rows":43,"n_cols":17,"rows_kept":43,"cut":false,"hidden":false,"merged":[[30,5,30,10],[31,5,31,10],[32,7,32,8],[33,7,33,8],[28,7,28,8],[33,1,34,4],[36,5,36,6],[36,7,36,8],[36,9,36,10],[32,1,32,4],[36,1,37,4],[37,5,37,6],[37,7,37,8],[37,9,37,10],[15,14,15,15],[24,7,24,8],[0,0,0,16],[1,0,1,16],[2,0,2,4],[13,1,16,4],[4,7,4,8],[8,1,10,16],[12,11,12,12],[12,14,12,15],[15,8,15,9],[6,7,6,8],[6,13,6,14],[7,11,7,16],[7,5,7,10],[12,5,12,6],[12,8,12,9],[2,6,2,10],[2,12,2,16],[4,13,4,14],[5,13,5,14],[5,7,5,8],[24,13,24,14],[17,7,17,8],[17,13,17,14],[30,11,30,16],[31,11,31,16],[28,13,28,14],[23,7,23,8],[22,7,22,8],[18,5,18,10],[18,11,18,16],[22,13,22,14],[23,13,23,14],[25,1,26,16],[20,1,24,4],[17,1,17,4],[28,1,29,4],[43,5,44,10],[38,11,38,16],[40,11,41,16],[43,11,44,16],[32,13,32,14],[33,13,33,14],[36,11,36,12],[36,13,36,14],[36,15,36,16],[37,11,37,12],[37,13,37,14],[37,15,37,16],[38,5,38,10],[40,5,41,10]]}
["児童の健康状況報告書（裏面）"]
[]
["入所希望児童氏名",null,null,null,null,"1人目氏名",{"$f":"IF(申込書!J26=\"\",\"\",申込書!J26)","v":""},null,null,null,null,"２人目氏名",{"$f":"IF(申込書!J30=\"\",\"\",申込書!J30)","v":""}]
["出生時の状況"]
[null,"出生時の体重",null,null,null,null,null,null,null,"ｇ",null,null,null,null,null,"ｇ"]
[null,"出産期間",null,null,null,null,null,null,null,"週",null,null,null,null,null,"週"]
[null,"出生時の異常",null,null,"　",null,null,null,null,"（有/無を選択）",null,null,null,null,null,"（有/無を選択）"]
[null,"症状(病名等)"]
[null,"≪0～2歳クラスをお申込みの場合≫\n　出生時体重が1,000ｇ未満又は妊娠28週未満で生まれたお子様については、「主治医の意見書」及び「心身状況表」を提出してください。\n\n≪3～5歳クラスをお申込みの場合≫\n　出生時体重が1,000ｇ未満かつ妊娠28週未満で生まれ、現在も通院があるお子様については、「主治医の意見書」及び「心身状況表」を提出してください。"]
[]
{"$rows_left_out":34}
{"sheet":"申込みチェックシート","index":8,"n_rows":111,"n_cols":60,"rows_kept":111,"cut":false,"hidden":false,"merged":[[44,60,45,60],[44,47,45,58],[44,59,45,59],[40,50,41,59],[40,46,41,49],[40,45,41,45],[44,45,45,45],[40,25,41,41],[18,2,18,56],[18,57,18,60],[22,2,22,56],[22,57,22,60],[23,2,23,56],[23,57,23,60],[24,2,24,56],[25,1,25,60],[19,2,19,56],[19,57,19,60],[20,2,20,56],[20,57,20,60],[21,2,21,56],[21,57,21,60],[27,1,30,1],[27,2,27,56],[0,1,0,60],[1,1,1,60],[2,1,2,60],[3,2,3,56],[3,57,3,60],[4,1,13,1],[4,2,4,56],[4,57,5,60],[5,2,5,56],[6,2,6,60],[7,2,7,56],[7,57,7,60],[8,2,8,60],[9,2,9,56],[9,57,9,60],[10,2,10,56],[10,57,10,60],[12,57,12,60],[13,57,13,60],[13,8,13,27],[12,54,12,56],[13,54,13,56],[27,57,27,60],[28,2,28,56],[28,57,28,60],[29,2,29,56],[29,57,29,60],[30,2,30,56],[30,57,30,60],[15,1,23,1],[15,2,15,56],[15,57,15,60],[16,2,16,56],[16,57,16,60],[17,2,17,56],[17,57,17,60],[32,2,32,56],[32,57,32,60],[33,2,33,56],[33,57,33,60],[34,2,34,56],[34,57,34,60],[35,2,35,56],[35,57,35,60],[36,2,36,56],[36,57,36,60],[48,1,50,1],[48,2,48,56],[48,57,48,60],[49,2,49,56],[49,57,49,60],[52,2,52,56],[52,57,52,60],[53,2,53,56],[53,57,53,60],[50,2,50,56],[50,57,50,60],[42,25,43,41],[44,25,45,41],[40,42,41,44],[42,42,43,44],[44,42,45,44],[33,1,46,1],[40,2,41,16],[42,2,43,16],[40,17,41,19],[42,17,43,19],[44,2,45,16],[44,17,45,19],[37,2,38,56],[44,46,45,46],[69,5,69,56],[68,57,69,60],[71,5,71,56],[73,5,73,56],[72,5,72,56],[71,57,72,60],[56,57,56,60],[57,2,57,56],[57,57,57,60],[58,2,58,56],[58,57,58,60],[60,1,60,60],[52,1,58,1],[62,2,62,56],[62,57,62,60],[55,2,55,56],[55,57,55,60],[56,2,56,56],[54,2,54,56],[54,57,54,60],[77,1,78,1],[77,2,77,56],[77,57,77,60],[78,2,78,56],[78,57,78,60],[80,1,82,1],[75,1,75,60],[66,57,66,60],[67,2,67,60],[68,2,68,4],[71,2,71,4],[62,1,73,1],[80,2,80,56],[80,57,80,60],[81,2,81,56],[81,57,81,60],[65,2,65,56],[65,57,65,60],[66,2,66,56],[63,2,63,56],[63,57,63,60],[64,2,64,56],[64,57,64,60],[68,5,68,56],[110,1,110,60],[84,1,86,1],[84,2,84,56],[84,57,84,60],[85,2,85,56],[85,57,85,60],[86,2,86,56],[86,57,86,60],[82,2,82,56],[82,57,82,60],[106,10,107,31],[102,19,102,20],[102,15,102,16],[102,7,102,11],[100,1,100,11],[88,1,97,1],[88,2,88,56],[88,57,88,60],[89,2,89,56],[90,2,90,56],[91,2,91,60],[92,2,92,4],[92,5,92,60],[89,57,89,60],[90,57,90,60],[96,2,96,4],[96,5,96,60],[97,2,97,59],[94,22,94,59],[94,19,94,21],[94,17,94,18],[94,13,94,16],[94,4,94,12]]}
[null,"申込みチェックシ－ト"]
[null,"◆1～11の内容を確認のうえ、確認欄に☑をつけてください。\n◆1～7については、すべての方が確認のうえ、確認欄に☑をつけてください。\n◆8～11については、各世帯で該当がある場合に確認のうえ、確認欄に☑をつけてください。\n◆内容を確認のうえ、最後の署名欄にご署名ください。\n◆4ページ目の【提出書類チェックシート】も必ず確認してください。"]
[]
[null,null,"1.重要事項確認",null,null,null,null,null,null,null,null,null,null,null,null,null,null,null,null,null,null,null,null,null,null,null,null,null,null,null,null,null,null,null,null,null,null,null,null,null,null,null,null,null,null,null,null,null,null,null,null,null,null,null,null,null,null,"確認欄"]
[null,null,"(1)退園・内定取消に関する同意"]
[null,null,"以下①～⑨の項目のいずれかに当てはまる場合、内定取消または退園となることに同意しました。"]
[null,null,"①就労中の方：入園後1か月以内に勤務条件の変更、または、転職や退職をされた場合\n②育児休業中の方：入園月の翌月1日までが復職日となっている「復職証明書」を提出できない場合。または、申込み時に提出した就労（予定）証明書の条件で\n   育児休業中の職場へ復帰ができない場合、および復職後1ヶ月以内に勤務条件の変更、転職または退職された場合\n③求職中の方：入園後3か月以内に、就労を開始したことがわかる「就労（予定）証明書」を提出できない場合\n④入園選考後に状況の変更（退職や転職、就労形態の変更など）が判明し、再選考を行った結果、世帯の指数が入園可能指数以下だった場合\n⑤入園後または復職後に保育を必要とする事由が継続できなかった場合\n⑥入園後一定の期間において、選考に利用した保育を必要とする事由の実績が、選考時の基準より下がった場合\n⑦入園後、欠席した日から2か月以内に再登園できない場合\n⑧入園内定後、豊島区から転出した場合\n⑨入園内定後、入園月の前月中に面接・健康診断が終了しない場合"]
[null,null,"(2)提出書類を提出書類チェックシート（4ページ目）に基づき確認し、内容に誤りがないことを確認しました。"]
[null,null,"【要確認項目】\n・就労（予定）証明書の実績は証明日から起算して直近の期間が記載されている（産前産後休業中および、育児休業中の方は、産前休業期間の直前の期間）。\n・入所申込書の「保育実施を希望する期間」が正しく記載されている（期間外は「保留通知書」または「入所申込をしていたが保留となった」ことを証明する書類の\n　発行はできません。証明が必要な月が「保育実施を希望する期間」に含まれているか今一度ご確認ください。なお、いかなる理由であっても申込み締切日翌日\n  以降の「保育実施を希望する期間」の前倒しの変更はできません）。\n・就労事由で入園した場合、在園継続のためには最低就労基準（令和4年度：月12日以上、月48時間以上かつ月収4万7千円以上）を毎月超える必要がある。"]
[null,null,"（3）入園申込み時にご提出いただいた入園関係書類について、必要な個人情報を保育の実施のために利用することおよび保育施設等に閲覧・提供することに同意します。"]
{"$rows_left_out":102}
{"sheet":"提出書類チェックシート","index":9,"n_rows":106,"n_cols":69,"rows_kept":106,"cut":false,"hidden":false,"merged":[[0,0,0,25],[0,26,0,70],[1,0,2,64],[1,65,2,70],[3,0,4,1],[3,2,4,28],[3,29,4,64],[3,65,4,67],[3,68,4,70],[9,2,10,28],[9,29,10,64],[9,65,10,67],[9,68,10,70],[11,2,12,28],[11,29,12,64],[11,65,12,67],[11,68,12,70],[5,0,22,1],[5,2,8,10],[5,11,6,28],[5,29,6,64],[5,65,6,67],[5,68,6,70],[7,11,8,28],[7,29,8,64],[7,65,8,67],[7,68,8,70],[17,2,18,28],[17,29,18,64],[17,65,18,67],[17,68,18,70],[19,2,20,28],[19,29,20,64],[19,65,20,67],[19,68,20,70],[13,2,14,28],[13,29,14,64],[13,65,14,67],[13,68,14,70],[15,2,16,28],[15,29,16,64],[15,65,16,67],[15,68,16,70],[25,0,26,64],[25,65,26,70],[27,0,28,64],[27,65,28,70],[29,0,30,64],[29,65,30,70],[21,2,22,28],[21,29,22,64],[21,65,22,67],[21,68,22,70],[23,0,24,64],[23,65,24,70],[35,11,35,20],[35,21,35,37],[37,2,39,17],[37,18,39,52],[37,53,39,58],[37,65,39,67],[31,2,32,64],[31,65,32,67],[31,68,32,70],[33,2,36,10],[33,38,36,58],[33,59,39,64],[33,65,36,67],[33,68,36,70],[34,11,34,20],[34,21,34,37],[42,0,43,64],[42,65,43,70],[45,2,46,28],[45,29,46,64],[45,65,46,67],[45,68,46,70],[37,68,39,70],[40,2,41,17],[40,18,41,39],[40,40,41,47],[40,48,41,64],[40,65,41,67],[40,68,41,70],[51,2,52,28],[51,29,52,64],[51,65,52,67],[51,68,52,70],[53,2,55,28],[53,29,55,64],[53,65,55,67],[53,68,55,70],[47,2,50,10],[47,11,48,28],[47,29,48,64],[47,65,50,67],[47,68,50,70],[49,11,50,28],[49,29,50,64],[61,2,62,28],[61,29,62,64],[61,65,62,70],[63,2,64,28],[63,29,64,64],[63,65,64,70],[56,2,58,28],[56,29,58,64],[56,65,58,67],[56,68,58,70],[59,2,60,28],[59,29,60,64],[59,65,60,67],[59,68,60,70],[70,2,73,10],[70,11,71,28],[70,29,71,64],[70,65,73,67],[70,68,73,70],[72,11,73,28],[72,29,73,64],[65,2,66,28],[65,29,66,64],[65,65,66,70],[67,2,69,28],[67,29,69,64],[67,65,69,67],[67,68,69,70],[80,2,81,28],[80,29,81,64],[80,65,81,70],[82,2,83,28],[82,29,83,64],[82,65,83,70],[74,2,76,28],[74,29,76,64],[74,65,76,67],[74,68,76,70],[78,2,79,28],[78,29,79,64],[78,65,79,67],[78,68,79,70],[89,33,92,64],[89,65,92,67],[89,68,92,70],[93,16,96,32],[93,33,96,64],[93,65,96,67],[93,68,96,70],[84,2,85,28],[84,29,85,64],[84,65,85,67],[84,68,85,70],[87,16,88,32],[87,33,88,64],[87,65,88,67],[87,68,88,70],[89,16,92,32],[87,2,89,3],[87,4,89,15],[90,2,92,3],[90,4,92,15],[93,4,96,15],[93,2,96,3],[102,0,103,1],[102,2,103,8],[102,9,103,64],[102,65,103,70],[105,0,105,70],[98,0,99,64],[98,65,99,70],[100,0,101,1],[100,2,101,8],[100,9,101,64],[100,65,101,70]]}
["提出書類チェックシート",null,null,null,null,null,null,null,null,null,null,null,null,null,null,null,null,null,null,null,null,null,null,null,null,null,"◆申込みの際は必ずこのチェックシートで提出書類を確認してください。\n◆記入漏れや不足書類によっては選考結果が不利になる場合があります。\n◆それぞれの書類についての詳細は入園のしおりをご覧ください。"]
["（1）保育を必要とする状況を証明する書類",null,null,null,null,null,null,null,null,null,null,null,null,null,null,null,null,null,null,null,null,null,null,null,null,null,null,null,null,null,null,null,null,null,null,null,null,null,null,null,null,null,null,null,null,null,null,null,null,null,null,null,null,null,null,null,null,null,null,null,null,null,null,null,null,"チェック欄"]
[]
[null,null,"保護者の事由",null,null,null,null,null,null,null,null,null,null,null,null,null,null,null,null,null,null,null,null,null,null,null,null,null,null,"必要書類",null,null,null,null,null,null,null,null,null,null,null,null,null,null,null,null,null,null,null,null,null,null,null,null,null,null,null,null,null,null,null,null,null,null,null,"父",null,null,"母"]
[]
[null,null,"就労",null,null,null,null,null,null,null,null,"会社員 （内定含む）　・　育児休業中の方",null,null,null,null,null,null,null,null,null,null,null,null,null,null,null,null,null,"就労証明書"]
[]
[null,null,null,null,null,null,null,null,null,null,null,"自営業・経営者・内職・親族経営会社で就労の方",null,null,null,null,null,null,null,null,null,null,null,null,null,null,null,null,null,"①就労証明書　　②自営業をしていることが客観的にわかる資料（1点）"]
[]
[null,null,"妊娠・出産",null,null,null,null,null,null,null,null,null,null,null,null,null,null,null,null,null,null,null,null,null,null,null,null,null,null,"母子手帳のコピー（表紙と出産予定日がわかるページ）"]
{"$rows_left_out":96}